{"text_format":"1","workbook":"xlsx","n_sheets":10,"sheets":["Notes & Info","Employer Information","Employer Compliance Checklist","Payments Made","Member Data","P9","Data Dictionary","Previous Years' Adjustments","Previous Years' Data Dictionary","More Information"],"not_rendered":{"charts":0,"images":15,"macros":1,"external_links":0,"defined_names":11,"comments":0,"pivot_tables":0},"unopened":[],"bounds":{"document_bytes":16777216,"sheet_cells":100000,"rows_first":2000,"rows_last":500,"rows_between":2000,"halvings":0,"cell_chars":16384,"cell_head_chars":4096},"cells_cut":0,"cells_raw":0,"read":"whole","date_system":"1900"}

{"sheet":"Notes & Info","index":0,"n_rows":945,"n_cols":19,"rows_kept":945,"cut":false,"hidden":false,"merged":[[104,1,104,12],[105,1,105,12],[106,1,106,12],[107,1,107,12],[108,1,108,12],[109,1,109,12],[116,1,116,12],[117,1,117,12],[118,1,118,12],[119,1,119,12],[120,1,120,12],[121,1,121,12],[110,1,110,12],[111,1,111,12],[112,1,112,12],[113,1,113,12],[114,1,114,12],[115,1,115,12],[357,1,357,12],[342,1,342,12],[331,1,331,12],[332,1,332,12],[333,1,333,12],[334,1,334,12],[335,1,335,12],[336,1,336,12],[325,1,325,12],[326,1,326,12],[327,1,327,12],[328,1,328,12],[329,1,329,12],[330,1,330,12],[358,1,358,12],[22,1,22,3],[22,4,22,12],[24,1,24,3],[24,4,24,12],[349,1,349,12],[350,1,350,12],[351,1,351,12],[352,1,352,12],[353,1,353,12],[354,1,354,12],[343,1,343,12],[344,1,344,12],[345,1,345,12],[346,1,346,12],[347,1,347,12],[348,1,348,12],[337,1,337,12],[338,1,338,12],[339,1,339,12],[340,1,340,12],[341,1,341,12],[355,1,355,12],[356,1,356,12],[321,1,321,12],[322,1,322,12],[323,1,323,12],[324,1,324,12],[313,1,313,12],[314,1,314,12],[315,1,315,12],[316,1,316,12],[317,1,317,12],[318,1,318,12],[319,1,319,12],[320,1,320,12],[307,1,307,12],[308,1,308,12],[309,1,309,12],[310,1,310,12],[311,1,311,12],[312,1,312,12],[301,1,301,12],[302,1,302,12],[303,1,303,12],[304,1,304,12],[305,1,305,12],[306,1,306,12],[295,1,295,12],[296,1,296,12],[297,1,297,12],[298,1,298,12],[299,1,299,12],[300,1,300,12],[289,1,289,12],[290,1,290,12],[291,1,291,12],[292,1,292,12],[293,1,293,12],[294,1,294,12],[283,1,283,12],[284,1,284,12],[285,1,285,12],[286,1,286,12],[287,1,287,12],[288,1,288,12],[277,1,277,12],[278,1,278,12],[279,1,279,12],[280,1,280,12],[281,1,281,12],[282,1,282,12],[271,1,271,12],[272,1,272,12],[273,1,273,12],[274,1,274,12],[275,1,275,12],[276,1,276,12],[265,1,265,12],[266,1,266,12],[267,1,267,12],[268,1,268,12],[269,1,269,12],[270,1,270,12],[259,1,259,12],[260,1,260,12],[261,1,261,12],[262,1,262,12],[263,1,263,12],[264,1,264,12],[253,1,253,12],[254,1,254,12],[255,1,255,12],[256,1,256,12],[257,1,257,12],[258,1,258,12],[247,1,247,12],[248,1,248,12],[249,1,249,12],[250,1,250,12],[251,1,251,12],[252,1,252,12],[241,1,241,12],[242,1,242,12],[243,1,243,12],[244,1,244,12],[245,1,245,12],[246,1,246,12],[235,1,235,12],[236,1,236,12],[237,1,237,12],[238,1,238,12],[239,1,239,12],[240,1,240,12],[229,1,229,12],[230,1,230,12],[231,1,231,12],[232,1,232,12],[233,1,233,12],[234,1,234,12],[223,1,223,12],[224,1,224,12],[225,1,225,12],[226,1,226,12],[227,1,227,12],[228,1,228,12],[217,1,217,12],[218,1,218,12],[219,1,219,12],[220,1,220,12],[221,1,221,12],[222,1,222,12],[211,1,211,12],[212,1,212,12],[213,1,213,12],[214,1,214,12],[215,1,215,12],[216,1,216,12],[205,1,205,12],[206,1,206,12],[207,1,207,12],[208,1,208,12],[209,1,209,12],[210,1,210,12],[199,1,199,12],[200,1,200,12],[201,1,201,12],[202,1,202,12],[203,1,203,12],[204,1,204,12],[193,1,193,12],[194,1,194,12],[195,1,195,12],[196,1,196,12],[197,1,197,12],[198,1,198,12],[187,1,187,12],[188,1,188,12],[189,1,189,12],[190,1,190,12],[191,1,191,12],[192,1,192,12],[181,1,181,12],[182,1,182,12],[183,1,183,12],[184,1,184,12],[185,1,185,12],[186,1,186,12],[175,1,175,12],[176,1,176,12],[177,1,177,12],[178,1,178,12],[179,1,179,12],[180,1,180,12],[170,1,170,12],[171,1,171,12],[172,1,172,12],[173,1,173,12],[174,1,174,12],[167,1,167,12],[168,1,168,12],[169,1,169,12],[158,1,158,12],[159,1,159,12],[160,1,160,12],[161,1,161,12],[162,1,162,12],[163,1,163,12],[154,1,154,12],[155,1,155,12],[156,1,156,12],[157,1,157,12],[150,1,150,12],[151,1,151,12],[164,1,164,12],[165,1,165,12],[166,1,166,12],[149,1,149,12],[139,1,139,12],[140,1,140,12],[141,1,141,12],[142,1,142,12],[143,1,143,12],[144,1,144,12],[152,1,152,12],[153,1,153,12],[135,1,135,12],[136,1,136,12],[137,1,137,12],[138,1,138,12],[134,1,134,12],[145,1,145,12],[146,1,146,12],[147,1,147,12],[148,1,148,12],[130,1,130,12],[131,1,131,12],[132,1,132,12],[133,1,133,12],[122,1,122,12],[123,1,123,12],[124,1,124,12],[125,1,125,12],[126,1,126,12],[127,1,127,12],[129,1,129,12],[128,1,128,12],[98,1,98,12],[99,1,99,12],[100,1,100,12],[101,1,101,12],[102,1,102,12],[103,1,103,12],[92,1,92,12],[93,1,93,12],[94,1,94,12],[95,1,95,12],[96,1,96,12],[97,1,97,12],[86,1,86,12],[87,1,87,12],[88,1,88,12],[89,1,89,12],[90,1,90,12],[91,1,91,12],[80,1,80,12],[81,1,81,12],[82,1,82,12],[83,1,83,12],[84,1,84,12],[85,1,85,12],[55,1,55,12],[56,1,56,12],[57,1,57,12],[58,1,58,12],[59,1,59,12],[60,1,60,12],[54,1,54,12],[45,1,45,12],[46,1,46,12],[47,1,47,12],[48,1,48,12],[49,1,49,12],[50,1,50,12],[51,1,51,12],[52,1,52,12],[53,1,53,12],[44,1,44,12],[35,1,35,12],[39,1,39,12],[40,1,40,12],[42,1,42,12],[43,1,43,12],[36,1,36,12],[38,1,38,12],[37,1,37,12],[41,1,41,12],[23,1,23,3],[23,4,23,12],[29,1,29,12],[30,1,30,12],[31,1,31,12],[32,1,32,12],[33,1,33,12],[34,1,34,12],[25,1,25,3],[25,4,25,12],[26,1,26,3],[26,4,26,12],[28,1,28,3],[28,4,28,12],[27,1,27,3],[27,4,27,12],[13,1,13,12],[14,1,14,12],[16,1,16,12],[15,1,15,12],[20,1,20,12],[21,1,21,12],[17,1,17,12],[18,1,18,12],[19,1,19,12],[3,1,3,12],[4,1,4,12],[6,1,6,12],[7,1,7,12],[10,1,10,12],[1,14,1,18],[3,14,3,18],[12,1,12,12],[9,1,9,12],[8,1,8,12],[5,1,5,12],[11,1,11,12],[79,1,79,12],[61,1,61,12],[66,1,66,12],[71,1,71,12],[74,1,74,12],[67,1,67,12],[68,1,68,12],[69,1,69,12],[70,1,70,12],[72,1,72,12],[73,1,73,12],[62,1,62,12],[63,1,63,12],[64,1,64,12],[75,1,75,12],[76,1,76,12],[77,1,77,12],[78,1,78,12],[65,1,65,12]]}
[]
[null,"Completing the Previous Years' Adjustments Workbook",null,null,null,null,null,null,null,null,null,null,null,null,"GMPF Contribution Rates"]
[]
[null,null,null,null,null,null,null,null,null,null,null,null,null,null,"2019-2020"]
[null,"These instructions provide a step by step guide to the data required for the population of the columns on your previous ",null,null,null,null,null,null,null,null,null,null,null,null,null,null,null,"MAIN","50/50"]
[null,"years' adjustments workbook."]
[null,null,null,null,null,null,null,null,null,null,null,null,null,null,"Band","Salary From","Salary To","Rate (%)","Rate (%)"]
[null,"Whilst every effort has been made to include as much information as possible, this guide is not definitive, and if you are",null,null,null,null,null,null,null,null,null,null,null,null,1,0,14400,"5.50","2.75"]
{"$rows_left_out":938}
{"sheet":"Employer Information","index":1,"n_rows":25,"n_cols":14,"rows_kept":25,"cut":false,"hidden":false,"merged":[[24,6,36,10],[6,2,6,3],[3,6,3,7],[3,9,3,10],[1,13,9,19],[11,13,11,17],[12,16,12,17],[13,13,13,17],[8,6,8,9],[12,6,12,9],[14,6,14,7],[16,6,16,10],[18,6,18,9],[20,6,20,7],[22,6,22,10]]}
[]
[null,"Employer Information ",null,null,null,null,null,null,null,null,null,null,null,"Please note: Once you have completed this workbook, you should send this securely to iconnect@gmpf.org.uk. Please print the worksheet named 'P9' and email a scanned, signed copy to this email address also. "]
[]
[null,null,"Adjustments required for:",null,null,null,null,null,"To:  "]
[]
[]
[null,null,"Employer Code:"]
[]
{"$rows_left_out":18}
{"sheet":"Employer Compliance Checklist","index":2,"n_rows":52,"n_cols":13,"rows_kept":52,"cut":false,"hidden":true,"merged":[[28,1,28,10],[47,3,47,8],[49,3,49,8],[27,1,27,13],[33,1,34,13],[35,1,37,13],[39,1,43,13],[30,11,30,13],[31,11,31,13],[29,11,29,13],[49,1,49,2],[45,1,45,2],[30,1,30,10],[31,1,31,10],[47,1,47,2],[29,1,29,10],[28,11,28,13],[3,10,3,11],[47,11,47,12],[5,1,6,13],[14,1,16,13],[18,1,18,10],[18,11,18,13],[22,1,22,10],[19,11,19,13],[23,1,23,10],[24,1,24,10],[24,11,24,13],[25,11,25,13],[3,3,3,8],[26,11,26,13],[45,3,45,8],[3,1,3,2],[22,11,22,13],[23,11,23,13],[19,1,19,10],[25,1,25,10],[26,1,26,10],[20,11,20,13],[21,11,21,13],[20,1,20,10],[21,1,21,10]]}
[]
[null,"Employer Compliance Checklist"]
[]
[null,"Name of Employer:",null,{"$f":"IF('Employer Information'!G9=\"\",\"\",'Employer Information'!G9)","v":""},null,null,null,null,null,null,"Employer code:",null,{"$f":"IF('Employer Information'!G7=\"\",\"\",'Employer Information'!G7)","v":""}]
[]
[null,"Greater Manchester Pension Fund requires confirmation that the pension data returned for the financial year 2019/20 is accurate and in accordance with the Scheme Regulations."]
[]
[]
{"$rows_left_out":45}
{"sheet":"Payments Made","index":3,"n_rows":39,"n_cols":16,"rows_kept":39,"cut":false,"hidden":true,"merged":[[18,0,18,1],[19,0,19,1],[0,1,0,3],[0,4,0,13],[2,1,3,16],[14,1,15,15],[11,6,11,7]]}
[null,"Please complete all areas in this colour",null,null,"Monthly payments Reconciliation",null,null,null,null,null,null,null,null,null,"Emp Code",{"$f":"IF('Employer Information'!G7=\"\",\"\",'Employer Information'!G7)","v":""}]
[null,"Section A - Employees basic contributions"]
[null,"Please enter the employees contributions for each month. You can pick these figures up from cell E20 on your P8 forms that have been submitted to our Accountancy section. Once you have entered these figures, all totals will be automatically populated. Cell G12 will be carried over to the P9 to compare the amount due to the amount paid."]
[]
[]
[]
[null,null,null,"April","May","June","July","August","September","October","November","December","January","February","March","Totals"]
[null,null,"Main",null,null,null,null,null,null,null,null,null,null,null,null,{"$f":"SUM(D8:O8)","v":0}]
{"$rows_left_out":32}
{"sheet":"Member Data","index":4,"n_rows":22,"n_cols":35,"rows_kept":22,"cut":false,"hidden":true,"merged":[[7,24,7,28],[9,24,9,28],[0,23,3,23]]}
["Greater Manchester Pension Fund ",null,null,null,null,null,null,null,null,null,null,null,null,null,null,"Employer Code",{"$f":"IF('Employer Information'!G7=\"\",\"\",'Employer Information'!G7)","v":""}]
["Annual Contribution Return  ",null,null,null,null,null,null,null,null,null,null,null,null,null,null,"Total Warnings",0,null,null,null,null,null,null,null,"Start and End Dates:","2019-04-01","2020-03-31"]
["",null,null,null,null,null,null,null,null,null,null,null,null,null,null,"Total Errors",0]
[""]
["NI Number","Payroll Number","Job Identifier","Employer Code (Number)","Surname","Initials / Forenames","FTE 2008 Reg Pay (Including notional pay)","Date Left (or Opted Out)","MAIN Scheme Start Date","MAIN Scheme End Date","MAIN CARE Pay (Including APP)","50/50 Scheme Start Date","50/50 Scheme End Date","50/50 CARE Pay (Including APP)","Contribution Rate at 31/03/XX","Employee Contributions (£)","Added Years (£)","Part Time Buy Back (£)","Additional Voluntary Contributions (AVCs) (£)","Additional Regular Contributions (ARCS) (£)","Employee Additional Pension Contributions (APC) (£)","Employer Additional Pension Contributions (APC) (£)","Comments",null,null,null,null,null,null,null,"Date Left (or Opted Out)","MAIN Scheme Start Date","MAIN Scheme End Date","50/50 Scheme Start Date","50/50 Scheme End Date"]
[]
[null,null,null,null,null,null,null,null,null,null,null,null,null,null,null,null,null,null,null,null,null,null,null,null,null,null,null,null,null,null,null,"2018-04-01","2018-09-30","2018-10-01","2019-03-31"]
[null,null,null,null,null,null,null,null,null,null,null,null,null,null,null,null,null,null,null,null,null,null,null,null,"GMPF Contribution Rates",null,null,null,null,null,null,"2018-04-01","2019-03-31"]
{"$rows_left_out":15}
{"sheet":"P9","index":5,"n_rows":37,"n_cols":16,"rows_kept":37,"cut":false,"hidden":false,"merged":[[20,13,23,14],[20,12,23,12],[13,13,17,13],[0,3,0,7],[0,0,0,2],[3,3,3,6],[3,8,3,10],[36,3,36,5],[32,1,33,2],[35,3,35,6],[27,7,27,10],[28,8,28,10],[29,7,29,10],[32,3,33,6],[32,8,33,10],[32,7,33,7],[34,3,34,6]]}
["Please complete all           areas in this colour",null,null,"P9"]
[null,null,null,"Previous Years' Adjustments reconciliation",null,null,null,null,null,null,null,null,"P9 Reconciliation"]
[]
[null,"Employer Name:",null,{"$f":"IF('Employer Information'!G9=\"\",\"\",'Employer Information'!G9)","v":""},null,null,null,"Employer Code:",{"$f":"IF('Employer Information'!G7=\"\",\"\",'Employer Information'!G7)","v":""},null,null,null,null,"YE Workbook","IF Post","Difference"]
[]
[null,"Section 1 - Contributions Due to the Fund",null,null,null,null,null,null,null,null,null,null,"Employees Standard Contributions",{"$f":"#REF!","v":{"$error":"#REF!"}},null,{"$f":"N6-O6","v":{"$error":"#REF!"}}]
[null,null,null,null,null,null,null,null,null,null,null,null,"Added Years",{"$f":"H10","v":0},null,{"$f":"N7-O7","v":0}]
[null,"Employee Contributions",null,null,null,null,"P9002",{"$f":"SUM('Previous Years'' Adjustments'!T:T)","v":0},"Column T","(previous years adjustments)"]
{"$rows_left_out":30}
{"sheet":"Data Dictionary","index":6,"n_rows":26,"n_cols":24,"rows_kept":26,"cut":false,"hidden":true,"merged":[[12,23,17,23],[23,7,23,12],[24,7,24,12],[25,7,25,12],[22,7,22,12],[18,7,18,12],[19,7,19,12],[20,7,20,12],[21,7,21,12],[14,7,14,12],[15,7,15,12],[21,14,21,19],[22,14,22,19],[23,14,23,19],[24,14,24,19],[25,14,25,19],[20,14,20,19],[11,14,11,19],[12,14,12,19],[13,14,13,19],[14,14,14,19],[15,14,15,19],[16,14,16,19],[17,14,17,19],[18,14,18,19],[19,14,19,19],[6,14,6,19],[7,14,7,19],[8,14,8,19],[9,14,9,19],[10,14,10,19],[16,7,16,12],[17,7,17,12],[4,7,4,12],[5,7,5,12],[6,7,6,12],[7,7,7,12],[8,7,8,12],[9,7,9,12],[10,7,10,12],[11,7,11,12],[12,7,12,12],[13,7,13,12],[22,3,22,5],[23,3,23,5],[24,3,24,5],[25,3,25,5],[17,3,17,5],[18,3,18,5],[19,3,19,5],[20,3,20,5],[21,3,21,5],[6,3,6,5],[8,3,8,5],[14,3,14,5],[15,3,15,5],[16,3,16,5],[7,3,7,5],[9,3,9,5],[10,3,10,5],[11,3,11,5],[12,3,12,5],[13,3,13,5],[4,3,4,5],[3,3,3,5],[3,7,3,12],[3,14,3,19],[5,3,5,5],[4,14,4,19],[5,14,5,19],[3,21,3,22],[4,21,4,22],[5,21,5,22],[6,21,6,22],[7,21,7,22],[11,21,11,22],[12,21,17,22],[18,21,18,22],[19,21,19,22],[8,21,8,22],[9,21,9,22],[10,21,10,22],[25,21,25,22],[20,21,20,22],[21,21,21,22],[22,21,22,22],[23,21,23,22],[24,21,24,22]]}
[null,null,null,null,null,null,null,null,"Data Descriptions and Formats"]
[]
[null,"For a more detailed explanation of the terms used in this workbook and the requirements to complete it, please refer to the \"Year End Specification\" Document "]
[null,"COLUMN/ROW",null,"FIELD",null,null,null,"DESCRIPTION",null,null,null,null,null,null,"FORMAT",null,null,null,null,null,null,"COMPULSORY/OPTIONAL"]
[null,"A5",null,"NI Number",null,null,null,"Member's national insurance number. Temporary numbers are not accepted.",null,null,null,null,null,null,"Alphanumeric, 9 characters",null,null,null,null,null,null,"COMPULSORY"]
[null,"B5",null,"Payroll Number",null,null,null,"Member's Payroll number as currently held in your system. This is used to match the returns to the records and it is therefore imperative that these are up to date for all staff. It should also be different for those with multiple employments unless we have previously agreed that you can use the next field.",null,null,null,null,null,null,"Alphanumeric, up to 12 characters",null,null,null,null,null,null,"COMPULSORY"]
[null,"C5",null,"Job Identifier",null,null,null,"This field can be used as a secondary match. Where employees have multiple employments with the same payroll number, it is essential this field is used and that you have our prior agreement.",null,null,null,null,null,null,"Alphanumeric, up to 12 characters",null,null,null,null,null,null,"OPTIONAL"]
[null,"D5",null,"Employer Code (Number)",null,null,null,"This is your 5 digit employer number eg A0014. You must include the leading A.",null,null,null,null,null,null,"Alphanumeric, 5 characters, starting with A",null,null,null,null,null,null,"COMPULSORY"]
{"$rows_left_out":19}
{"sheet":"Previous Years' Adjustments","index":7,"n_rows":1005,"n_cols":59,"rows_kept":1005,"cut":false,"hidden":false,"merged":[[2,2,2,7],[2,34,2,39]]}
["Greater Manchester Pension Fund ",null,null,null,null,null,null,null,null,null,null,null,null,null,null,null,null,null,null,null,null,null,null,null,null,null,null,null,null,null,null,null,"Greater Manchester Pension Fund "]
[null,null,null,null,null,null,null,null,null,null,null,null,null,null,null,null,null,null,null,null,null,null,0]
["Emp code",0,"Please provide explanation for EVERY adjustment in column AA",null,null,null,null,null,"Autofilled",null,null,null,null,"Autofilled",null,null,"Autofilled",null,null,"Autofilled",null,"Total Errors",0,null,null,null,null,null,null,null,null,null,"Emp code",0,"Please provide explanation for EVERY adjustment in column AA",null,null,null,null,null,"Autofilled",null,null,null,null,"Autofilled",null,null,"Autofilled",null,null,"Autofilled",null,"Total Errors",3]
[]
["NI number","Payroll Number","Job Identifier","Employer code","Surname","Initials / Forenames","2008 Regs Pay previously provided","Amended 2008 Regs Pay, including Notional Pay","Difference","Date from","Date to","MAIN Scheme Pay previously provided ","Amended MAIN Scheme pay, including APP","Difference","50/50 Scheme pay previously provided","Amended 50/50 Scheme pay, including APP","Difference","Employee Contribution amount previously provided ","Amended Employee Contribution amount","Difference","Added years adjustment","Additional Voluntary Contributions (AVC) adjustment","Additional Regular Contributions (ARCS) adjustment","Employee APC adjustment","Employer APC adjustment","Employer Contribution difference","Additional information",null,"Date from","Date to",null,null,"NI number","Payroll Number","Job Identifier","Employer code","Surname","Initials / Forenames","2008 Regs Pay previously provided","Amended 2008 Regs Pay, including Notional Pay","Difference","Date from","Date to","MAIN Scheme Pay previously provided ","Amended MAIN Scheme pay, including APP","Difference","50/50 Scheme pay previously provided","Amended 50/50 Scheme pay, including APP","Difference","Employee Contribution amount previously provided ","Amended Employee Contribution amount","Difference","Added years adjustment","Additional Voluntary Contributions (AVC) adjustment","Additional Regular Contributions (ARCS) adjustment","Employee APC adjustment","Employer APC adjustment","Employer Contribution difference","Additional information"]
["",null,null,null,null,null,null,null,0,null,null,null,null,0,null,null,0,null,null,0]
[null,null,null,null,null,null,null,null,{"$f":"(H7-G7)","v":0},null,null,null,null,{"$f":"(M7-L7)","v":0},null,null,{"$f":"(P7-O7)","v":0},null,null,{"$f":"(S7-R7)","v":0},null,null,null,null,null,null,null,null,"2019-04-01","2020-03-31"]
[null,null,null,null,null,null,null,null,0,null,null,null,null,0,null,null,0,null,null,0,null,null,null,null,null,null,null,null,"2019-04-01","2020-03-31"]
{"$rows_left_out":998}
{"sheet":"Previous Years' Data Dictionary","index":8,"n_rows":30,"n_cols":21,"rows_kept":30,"cut":false,"hidden":false,"merged":[[4,2,4,4],[4,6,4,11],[4,13,4,18],[4,20,4,21],[5,2,5,4],[5,6,5,11],[5,13,5,18],[5,20,5,21],[2,2,2,4],[2,6,2,11],[2,13,2,18],[2,20,2,21],[3,2,3,4],[3,6,3,11],[3,13,3,18],[3,20,3,21],[8,2,8,4],[8,6,8,11],[8,13,8,18],[8,20,8,21],[6,2,6,4],[6,6,6,11],[6,13,6,18],[6,20,6,21],[7,2,7,4],[7,6,7,11],[7,13,7,18],[7,20,7,21],[10,2,10,4],[10,6,10,11],[10,13,10,18],[10,20,10,21],[11,2,11,4],[11,6,11,11],[11,13,11,18],[11,20,11,21],[9,2,9,4],[9,6,9,11],[9,13,9,18],[9,20,9,21],[17,2,17,4],[17,6,17,11],[17,13,17,18],[18,2,18,4],[18,6,18,11],[18,13,18,18],[14,2,14,4],[14,6,14,11],[14,13,14,18],[15,2,15,4],[15,6,15,11],[15,13,15,18],[16,2,16,4],[16,6,16,11],[16,13,16,18],[22,6,22,11],[22,13,22,18],[22,20,22,21],[19,2,19,4],[19,6,19,11],[19,13,19,18],[20,2,20,4],[20,6,20,11],[20,13,20,18],[26,2,26,4],[26,6,26,11],[26,13,26,18],[26,20,26,21],[29,2,29,4],[29,6,29,11],[29,13,29,18],[29,20,29,21],[14,20,14,21],[15,20,15,21],[16,20,16,21],[17,20,17,21],[18,20,18,21],[19,20,19,21],[27,2,27,4],[27,6,27,11],[27,13,27,18],[27,20,27,21],[28,2,28,4],[28,6,28,11],[28,13,28,18],[28,20,28,21],[23,2,23,4],[23,6,23,11],[12,2,12,4],[12,6,12,11],[12,13,12,18],[12,20,12,21],[13,2,13,4],[13,6,13,11],[13,13,13,18],[13,20,13,21],[25,2,25,4],[25,6,25,11],[25,20,25,21],[25,13,25,18],[23,13,23,18],[23,20,23,21],[24,2,24,4],[24,6,24,11],[24,13,24,18],[24,20,24,21],[20,20,20,21],[21,2,21,4],[21,6,21,11],[21,13,21,18],[21,20,21,21],[22,2,22,4]]}
[null,null,null,null,null,null,null,"Data Descriptions and Formats"]
[]
["COLUMN/ROW",null,"FIELD",null,null,null,"DESCRIPTION",null,null,null,null,null,null,"FORMAT",null,null,null,null,null,null,"COMPULSORY/OPTIONAL"]
["A5",null,"NI number",null,null,null,"Member's national insurance number. Temporary numbers are not accepted.",null,null,null,null,null,null,"Alphanumeric, 9 characters",null,null,null,null,null,null,"COMPULSORY"]
["B5",null,"Payroll Number",null,null,null,"Member's Payroll number as currently held in your system. This is used to match the data to the correct records and it is therefore imperative that these are up to date for all staff. It should also be different for those with multiple employments unless we have previously agreed that you can use the next field.",null,null,null,null,null,null,"Alphanumeric, up to 12 characters. Must include leading zeros where applicable.",null,null,null,null,null,null,"COMPULSORY"]
["C5",null,"Job Identifier",null,null,null,"This field can be used as a secondary match. Where employees have multiple employments with the same payroll number, it is essential this field is used and that you have our prior agreement.",null,null,null,null,null,null,"Alphanumeric, up to 12 characters",null,null,null,null,null,null,"OPTIONAL"]
["D5",null,"Employer code",null,null,null,"This is your 5 digit employer number eg A0014. You must include the leading A.",null,null,null,null,null,null,"Alphanumeric, 5 characters",null,null,null,null,null,null,"COMPULSORY"]
["E5",null,"Surname",null,null,null,"Enter the member's surname.",null,null,null,null,null,null,"Alphabetic, up to 25 characters",null,null,null,null,null,null,"COMPULSORY"]
{"$rows_left_out":23}
{"sheet":"More Information","index":9,"n_rows":64,"n_cols":7,"rows_kept":64,"cut":false,"hidden":false,"merged":[[57,3,59,3],[57,4,59,4],[57,5,59,5],[57,6,59,6],[51,2,51,6],[53,6,54,6],[55,3,56,3],[55,4,56,4],[55,5,56,5],[55,6,56,6],[46,2,46,6],[47,2,47,6],[48,2,48,6],[49,2,49,6],[50,2,50,6],[40,2,40,6],[41,2,41,6],[42,2,42,6],[43,2,43,6],[44,2,44,6],[45,2,45,6],[33,2,33,6],[34,1,63,1],[34,2,34,6],[35,2,35,6],[36,2,36,6],[37,2,37,6],[38,2,38,6],[39,2,39,6],[60,3,62,3],[60,4,62,4],[60,5,62,5],[60,6,62,6],[53,3,54,3],[53,4,54,4],[53,5,54,5],[25,1,26,1],[25,2,25,6],[26,2,26,6],[27,2,27,6],[28,1,33,1],[28,2,28,6],[29,2,29,6],[15,2,15,6],[16,2,16,6],[30,2,30,6],[31,2,31,6],[32,2,32,6],[18,2,18,6],[19,2,19,6],[20,2,20,6],[21,2,21,6],[22,2,22,6],[23,2,23,6],[1,1,17,1],[1,2,1,6],[2,2,2,6],[3,2,3,6],[4,2,4,6],[5,2,5,6],[17,2,17,6],[6,2,6,6],[7,2,7,6],[8,2,8,6],[9,2,9,6],[10,2,10,6],[11,2,11,6],[12,2,12,6],[13,2,13,6],[14,2,14,6]]}
[]
[null,"FTE Final Salary Pay (2008 Regs)","Any member who was a member of the scheme before 1/4/2014 will have membership in the final salary scheme. Even if the member only started employment with you after 1/4/2014, they may have linked their previous membership of the scheme, meaning they have final salary pension benefits.  You may not necessarily know if an employee has linked their employment, so please provide the 2008 Regs pay figure as a matter of course for all employees. For part-time or term-time members this should be the full time equivalent pay NOT their actual pay."]
[null,null,"Under the 2008 Regs, pensionable pay is all the salary, wages, fees and other payments paid to the employee, apart from the exclusions shown below."]
[null,null,"Pensionable pay does not include:-"]
[null,null,"• Non-contractual overtime"]
[null,null,"• Any sum which has not had income tax liability"]
[null,null,"• Travel, subsistence or other expenses/allowance, including provision of a motor vehicle"]
[null,null,"• Payment in consideration of loss of holidays"]
{"$rows_left_out":56}